Yarn Jest Error Command Failed With Exit Code 1

yarn jest error command failed with exit code 1. system (system) closed January 18, 2019, 2:25am #5. Wasn't sure the best approach so I mostly used the custom starter themes part of the documentation. You can right click on the folder and delete it or you can use rm -rf node_modules to delete it with its content. akhilapenjuru1 January 6, 2022, 12:35pm. command failed with exit code 1: yarn build. sh: #!/bin/bash echo "Exit command test" exit 0. GitHub - heroku/heroku-buildpack-multi. To get this working in Heroku, I needed to use two build packs: -----> Building on the Heroku-20 stack -----> Using buildpacks: 1. C:\Dev\Projects\NodeJsStack\React-Mobile\React&TypeScript\MyApp>yarn android yarn run v1. Build command from Netlify app │ 1:25:19 PM: └───────────────────────────────────┘ 1:25:19 PM: 1:25:19 PM: $ yarn build 1:25:19 PM: yarn run v1. IF ERRORLEVEL 1 (. The installation dependency is consistent with building fresh packages. YN0008 - MUST_REBUILD A package must be rebuilt. As shown below: The culprit of the stuck isnode-sassThis package. I've been trying to debug this every way imaginable for the past several hours, but can't seem to get to the root of the issue or any meaningful errors. this is the error file generated- yarn-error. I am Senthil Kumar, more commonly known as SK to my friends, from India. Here’s an example… Let’s write a script called exit_status. PS D:\react project\ReactManagement-tutorial> yarn dev yarn run v1. Change the attribute under other linker flags to – all_ Load (or delete the attributes below); (in targets > build setting > other linker flags) 4. Now if we run yarn test we should see following: No tests found, exiting with code 1. com/en/docs/cli/run for documentation about this command. These exceptions indicate a JAR dependency conflict or Spark version conflict. test:jest: `jest --config=. 這類錯誤檢視的關鍵在於其上一行的文字。. Command failed to execute EPM Automate uses this exit code to display messages related to HTTP status code 200 and 400. 1 Msbuild error: the command exited with code 255 due to post build event command React native iOS build clang: error: linker command failed with exit code 1 (use -v to see invocation). to the end of my batch file. The exit command returns an exit code back to the shell. First, create a new React App using the following command: npx create-react-app my-react-app. Copy the full commit hash. json: No license field. yarn cache clean (proceed to the next step if this command fails) yarn; yarn build; yarn start; If you bumped into some errors during the execution of the yarn build command, you can try resetting your local repository: Go to the Releases page. We’re going to start by adding jest to our project. nx : Not Found @nrwl/angular : 12. KerberosAuthException. pip list Checking installed packages. 0 warning package. lionroy on 18 Jul 2018. Same thing happens to me as for OP, if I run Jest directly from node_modules/. Cookie Duration Description; cookielawinfo-checbox-analytics: 11 months: This cookie is set by GDPR Cookie Consent plugin. setTimeout(newTimeout) to increase the timeout value, if this is a long-running test. Cloned the Slate repo. How can we verify that this is actually the code passed by the script back to the shell? We use the $? variable. In the joblog however, we can find the script completed with an "Exit code 0" which means "No errors" on the execution of the script on the Agent:. npm ERR! This is probably not a problem with npm. Adding jest and types to our project. Test Suites: 1 skipped, 106 passed, 106 of 107 total Tests: 10 skipped, 657 passed, 667 total Snapshots: 14 files obsolete, 0 total Time: 34. The yarn kbn bootstrap command only still skips the dependencies as shown in the above comment. yarn run v1. 2 @nrwl/cli : 12. i think that's it yet, may have skipped a step or two better read more about the cli commands i suppose. PASS src/test/restart. Delete the node_modules folder. StorybookJS. GitHub - heroku/heroku-buildpack-nodejs: The official Heroku buildpack for Node. What wasn't fine, as I just discovered, was I needed to add a. json: No license field. There is likely additional logging output above. json to support a new yarn test command. 478s Ran all test suites. npm WARN Local package. Exit status 1 npm ERR! npm ERR! Failed at the @ start script. thrown: "Exceeded timeout of 5000 ms for a test. Udemy Courses:- 9 React Projects on Udemy - https://bit. We had to run the command yarn before we start the project. We had to install all the dependencies first. Click the commit associated with the latest release to open the commit page. 2" is an optional dependency and failed compatibility check. module yarn. warning package. We need to modify a couple of things to make this Storybook compatible with our NextJS and MaterialUI settings. 2: The platform "linux" is incompatible with this module. 3 OS : win32 x64 yarn : 1. The solution. json: If react-scripts is in the package. json: No license field $ concurrently --kill-others-on-fail "yarn server" "yarn client" warning package. json exists, but node_modules missing, did you mean to install? npm ERR! A complete log of this run can be found in: npm ERR!. js` npm ERR!. Replication steps. The "Exit Code 1" is simply a "Generic Exit Code" which means the job failed and this can be for any reason. x and required 1. ly/2D83M8c- 9 React Projects on Gumroad - https://h3webdevtuts. Running Yarn Start ends with error Command failed with exit code 1. Environment. Problem statement Container fails shortly after start with the following exception: Exception in thread "main" org. ; If it doesn't work even after running the install command,. I had a partial fix for this a few days ago (prefixing all the commands with "node "), however I discovered the commands containing environment variables don't work on Windows either, since it needs them to be of form `set FOO=bar node ` not `FOO=bar node `. If you still find the same error, there's one last thing you can try to fix it, which is generating a new React application with Create React App. yarn create slate-theme my-theme-edit my-theme-edit/. Hi there, I have downloaded grafana code from github and when I run ‘Yarn start’ command it is giving me the error. 10 $ NODE_OPTIONS =--experimental-vm-modules jest src/components/post (node:30646) ExperimentalWarning: VM Modules is an experimental feature. Make customizations to an Envato purchased theme. So I decided to add yarn cache to optimize build time and the cache process works, but jest fails with. error Command failed with exit code 127. I love to read, write and explore topics on Linux, Unix and all other technology related stuff. error Command failed with exit code 1. Add Own solution. Excluding it from installation. Is it possible to use the Vue CLI—particularly its plugins—within a multi-package Lerna and Yarn workspace repository? I'd love to be able install the Jest plugin and have it be available to all of my packages. The project relies on node-sass yarn. $ yarn add yarn |> to actually update yarn as it was 1. js $ cd client && yarn start warning. TypeScript\MyApp\android' is not recognized as an internal or external command. It should be there. Common PostgreSQL errors and warnings to watch out for, with symptoms and solutions. json: No license field warning package. 453s Ran all test suites. Replication steps Cloned the Slate repo. x i think that's it yet, may have skipped a step or two better read more about the cli commands i suppose. NX Report complete. If react-scripts is in the package. Next we’ll modify our package. linker command failed with exit code 1. After checking every classpath for errors during like an hour or so, I noticed this in my yarn-site. 4 1:25:19 PM: $ react-scripts build 1:25:20 PM: Creating an optimized production build 1:25:27 PM: Failed to compile. Open the Command Prompt by searching it through the Windows search feature. $ yarn or $ yarn install. PS D:\react project\ReactManagement-tutorial> yarn dev yarn run v1. This usually occurs in only two cases: either the package never has been built before, or its previous build failed (returned a non-zero exit code). Hello, Yes, I checked that and the permissions were fine. yarn create slate-theme my-theme-edit my-theme-edit/. So perhaps it is because of RAM space. SOLUTION - $ yarn info |> made me realize some 2k files are out of date then ran $ yarn upgrade |> and it somehow sorted it but didn't compile yet then $ yarn add yarn |> to actually update yarn as it was 1. My repo uses yarn workspaces to share dependencies. 4 $ react-native run-android info Running jetifier to migrate libraries to AndroidX. Once the installation is finished, run the application using npm start command: cd my-react-app npm start. This feature could change at any time (Use `node --trace-warnings ` to show where the warning was created) error Command failed with exit code 1. 4 [1/4] Resolving packages [2/4] Fetching packages info [email protected] Compiler error: linker command failed with exit code 1. These codes are returned by the REST APIs that EPM Automate uses. Using Github actions to publish npm package, It works and runs jest test cases without errors. This has been working for the past year, but recently just stopped working with the exit code 1. clang: error: linker command failed with exit code 1 (use -v to see invocation) in xcode5. 出現這個錯誤的原因有多種,常見的是因為某些檔案的缺失或者是檔案的重複導致的。. In case if you face the issue even after running yarn install, you can get. 2 $ react-scripts start 'react-scripts' is not recognized as an internal or external command, operable program or batch file. In the project, the file name is repeated and the header file is introduced repeatedly (it may cause duplication when using cocoapods); 3. ; Type the following command to get the list of installed packages. $ yarn test src/components/post yarn run v1. yarn add v1. The cookie is used to store the user consent for the cookies in the category "Analytics". The Goal Make customizations to an Envato purchased theme. Could not find or load main class org. json: No license field $ nodemon server. Exit Code 1 Errors. address algorithm android array assembly attribute Browser c Catalog Character string Client code command configuration file css data Database data base Edition element Example file function golang html html5 ios java javascript linux method mysql node node. this is the error file generated-yarn-error. GradleWrapperMain. このエラーが出てyarn start, npm run 出来ない場合、それは新しいモジュールを追加した後にyarn. All tests run successfully, but returns with exit code 1. json file, you need to reinstall your packages. 10 $ cross-env NODE_OPTIONS=--experimental-vm-modules jest (node:1806) ExperimentalWarning: VM Modules is an experimental feature. info "[email protected] yarn install v1. 2 @nrwl/cypress : 12. Check the JAR executable and/or the extra JAR files passed in the job for conflict. I’m moving my multi-app monorepo from Heroku to Fly and I have questions. but it keeps on giving me this error:"linker command failed with exit code 1". ts √ restart (711ms) Test Suites: 1 passed, 1 total Tests: 1 passed, 1 total Snapshots: 0 total Time: 2. This information message occurs when Yarn wishes to let you know that a package will need to be rebuilt in order for the installation to complete. If you are using NPM as your package manager then you can run the following command to install dependencies: $ npm install. info Visit https://yarnpkg. what you need to do is just simple: follow these steps: rm -rf node_modules yarn cache clean yarn yarn start. FAILED (command write failed (No error)) finished. Run with `--passWithNoTests` to exit with code 0. Run npm install or yarn install to install it. First, let's install the storybook-addon-material-ui addon and configure it on the Storybook settings files. $ yarn add --dev storybook-addon-material-ui. 編譯時出現錯誤 -- clang: error: linker command failed with exit code 1 (use -v to see invocation) 2019-01-10 254. One possible solution for this is a package called cross-env, however it turns. npm ERR! code ELIFECYCLE npm ERR! errno 1 npm ERR! @vc/[email protected] bin/jest it run through successfully but when ran as npm script it returns exit code 1. So, here we are passing the exit code 0 to the exit command. Error: Command failed: yarn run kbn:bootstrap Error: spawn git ENOENT at Process.

ifm wgz kmr kij wyz cdx iyf usi kla ivm ibl vwi lfv zme ews ibx qeb mud cwm kve